BDBM50279932 CHEMBL3318351
SMILES CSC1=NNC(S1)c1ccccn1
InChI Key InChIKey=COBKEFOWTCEAKB-UHFFFAOYSA-N
Data  1 IC50
  Tab Delimited (TSV)   2D SDfile   Computed 3D by Vconf -m prep SDfile
Find this compound or compounds like it in BindingDB:
Activity Spreadsheet -- Enzyme Inhibition Constant Data from BindingDB
Found 1 hit for monomerid = 50279932
TargetCystathionine gamma-lyase(Homo sapiens (Human))
University Of Illinois At Chicago
Curated by ChEMBL
LigandPNGBDBM50279932(CHEMBL3318351)
Affinity DataIC50:  6.00E+3nM. Assay description: Inhibition of cystathionine gamma-lyase (unknown origin) assessed as reduction in cysteine formation from CPM using L-cystathionine pre-incubated for...
In DepthDetails ArticlePubMed